Home > Cannot Execute > Scripts/mod/modpost Cannot Execute Binary File

Scripts/mod/modpost Cannot Execute Binary File

Contents

Why were pre-election polls and forecast models so wrong about Donald Trump? davef 2015-10-31 21:26:03 > make: arm-none-linux-gnueabi-gcc: Command not found Think you want to sort this first. is there a script in the build folder to do this? share|improve this answer answered Jun 13 '12 at 3:07 LawrenceC 47.2k677146 6 "if you try to run x86 executables on an ARM CPU, this message comes up." That was EXACTLY my review here

Sorry, don't know anything about VirtualBox sham 2013-11-28 06:32:58 [email protected]:/opt/linux-cortexm-1.4.1/projects/lcdtest# make cp -f /opt/linux-cortexm-1.4.1/linux/initramfs-list-min.stub \ /opt/linux-cortexm-1.4.1/linux/initramfs-list-min rm -f /opt/linux-cortexm-1.4.1/linux/usr/initramfs_data.cpio \ /opt/linux-cortexm-1.4.1/linux/usr/initramfs_data.cpio.gz cp -f lcdtest.kernel.LPC /opt/linux-cortexm-1.4.1/linux/.config make -C /opt/linux-cortexm-1.4.1/linux vmlinux make[1]: arm-none-eabi-gcc: My issue is resolved now. Show 25 comments25 RepliesNameEmail AddressWebsite AddressName(Required)Email Address(Required, will not be published)Website AddressAurelien Bouin Apr 18, 2007 12:00 PMMark CorrectCorrect Answer I already had your problem in doing driver with ltib, I'm Entry from bash file: PATH=$PATH:/opt/FriendlyARM/toolschain/4.5.1/bin arm-linux-gcc -v gives below output.

Cannot Execute Binary File Linux

My concern is how >come it works for some users but fails for others? >Any help is greatly appreciated. >Regards >B > >Cat testscript >bash-2.03$ cat testscript >PATH=/usr/local/bin/ >bash-2.03$ > >bash-2.03$ Thanks for your explains.Now, I'm trying to access to the IMMR. Your operating system does not mean the same executable will run. I have installed Sourcery CodeBench Lite for ARM GNU/Linux (arm-2012.09-64-arm-none-linux-gnueabi.bin) on it.

more stack exchange communities company blog Stack Exchange Inbox Reputation and Badges sign up log in tour help Tour Start here for a quick overview of the site Help Center Detailed As a monk, can I use Deflect Missiles to protect my ally? What do you get when you do: arm-linux-gcc -v Amit P 2016-02-22 03:57:35 Hello, I am compiling modules for tiny6410 with make modules and I am getting similar error. Cannot Execute Binary File Java Sandeep davef 2012-09-12 17:37:04 Have a look in "/opt/FriendlyARM/toolschain/4.5.1/bin" and see if there really is a "arm-linux-gcc" or a link to one.

Which cross-compiler are you using? Cannot Execute Binary File Exec Format Error Ubuntu Report this message « [procmailrc] Problem with a filter never matched Index How to using getopt get value with space ? » FriendlyARM.COMHomeProductsDownloadsForumDevelopmentSales All ForumsNewsGeneralBootloaderLinuxAndroidWinCENo OSHardwareOfftopic kernel compile error Error 127 In it, you'll get: The week's top questions and answers Important community announcements Questions that need answers see an example newsletter By subscribing, you agree to the privacy policy and terms http://stackoverflow.com/questions/2534065/shell-complains-cannot-execute-binary-file Thanks in advance..

CC kernel/bounds.s /bin/sh: arm-linux-gcc: not found make[1]: *** [kernel/bounds.s] Error 127 make: *** [prepare0] Error 2 I am getting the above error when i try to compile kernel for arm-linux Tiny6410 Bash Cannot Execute Binary File Exec Format Error After that all the binaries should be setup properly. –artless noise Apr 5 '13 at 14:14 I successfully used the host's scripts (via mount --bind) to make the sources Have got fix for the problem. PS.

Cannot Execute Binary File Exec Format Error Ubuntu

ls -la /path/to/testscript Report this message #5: Re: Shell - cannot execute binary file Posted on 2005-11-23 09:58:03 by Thorsten Kampe * tester (2005-11-22 23:56 +0100) >> I'm guessing it works Let's put some order here! Cannot Execute Binary File Linux I encountered this error "cannot execute binary file" when installing FF.Communicator - a firefox plugin for chrome (so I can run pages that use java applets). Cannot Execute Binary File Bash Done Building dependency tree Reading state information...

To start viewing messages, select the forum that you want to visit from the selection below. ** If you are logged in, most ads will not be displayed. ** Linuxforums now http://rss4medics.com/cannot-execute/perl-cannot-execute-binary-file.php That is what i need to find out. > > bash-2.03$ cat /etc/passwd | grep oracle > oracle:x:100:100:Oracle account:/home/oracle:/bin/bash > bash-2.03$ cat /etc/passwd | grep pnetops > pnetops:x:101:101:Pnetops account:/home/pnetops:/bin/bash > > CHK include/linux/utsrelease.h SYMLINK include/asm -> include/asm-arm CC kernel/bounds.s /bin/sh: 1: arm-linux-gcc: not found /home/pt/Desktop/linux-2.6.32.2/./Kbuild:35: recipe for target 'kernel/bounds.s' failed make[1]: *** [kernel/bounds.s] Error 127 Makefile:982: recipe for target 'prepare0' failed make: It would be just great, if somebody could help me. Cannot Execute Binary File Mac

HttpContext.Current.Request.Url doesn't return language code In the context of this quote, how many 'chips/sockets' do personal computers contain? Arun 2012-10-17 20:08:41 Hi davef/Sandeep, I am also facing same problem.. export PATH=$PATH:/absolute path where your cross-compiler binaries are present. get redirected here Because your $PATH is not set, bash is only able to run commands with the full path specified.

Stop.make[1]: *** [modules] Error 2make[1]: Leaving directory `/home/Admin/Document/MPC8641d/Install/ltib-mpc8641hpcn-20080117/rpm/BUILD/linux-2.6.23'make: *** [default] Error 2Thanks and Regard'sHrishikesh.Like • Show 0 Likes0 Actions Rekha Subramanian @ Aurelien Bouin on Oct 24, 2007 12:48 PMMark CorrectCorrect Cannot Execute Binary File Ubuntu Nothing else. –superuser Jun 12 '12 at 21:33 3 PATH is an environment variable which contains a list of folders which the shell searches for programs. How do I avoid referring to all state variables when updating only a few?

You can use uname to check architecture of a machine.

ath_hal: 0.9.18.0 (AR5210, AR5211, AR5212, RF5111, RF5112, RF2413, RF5413, REGO) wlan: 0.8.4.2 (0.9.3.1) ath_pci: 0.9.4.5 (0.9.3.1) ath_rate_sample: 1.2 (0.9.3.1) wifi0: 11a rates: 6Mbps 9Mbps 12Mbps 18Mbps 24Mbps 36Mbps 48Mbps 54Mbps wifi0: No problem there. im using ubuntu 11.10 and tiny6410 board. Cannot Execute Binary File Exec Format Error Cygwin wlanconfig.c make[1]: Leaving directory `/root/madwifi/madwifi-0.9.3.1/tools' を~でけた!!\(^o^)/ ひょっとして、debianパッケージのmadwifiもコンパイルが通るかな~? っと、思ったら! ダメジャン!! きっとdebianのモジュールツールがmadwifiをコンパイルするのに必要な何かが足りないんだろうな~ 気を取り直して、本家ソースをインストール! madwifi-0.9.3.1# make install sh scripts/find-madwifi-modules.sh 2.6.21.1 for i in ./ath ./ath_hal ./ath_rate ./net80211; do \ make -C $i install ||

Thank you. athchans.c gcc -o athctrl -g -O2 -Wall -I. -I../hal -I.. This time for OLinuXino I don't have the build sources so I copied the rootfs (using cp -dR) to my Ubuntu PC and tried cross compiling a hello world kernel module useful reference Powered by vBulletin Version 4.2.2Copyright ©2000 - 2016, Jelsoft Enterprises Ltd.

Run 'make oldconfig && make prepare' on kernel src to fix it.mkdir -p /home/Admin/Document/MPC8641d/Install/ltib-mpc8641hpcn-20080117/rpm/BUILD/test/.tmp_versionsrm -f /home/Admin/Document/MPC8641d/Install/ltib-mpc8641hpcn-20080117/rpm/BUILD/test/.tmp_versions/* WARNING: Symbol version dump /home/Admin/Document/MPC8641d/Install/ltib-mpc8641hpcn-20080117/rpm/BUILD/linux-2.6.23/Module.symvers is missing; modules will have no dependencies and modversions.make -f Ballpark salary equivalent today of "healthcare benefits" in the US? Thanks everyone for your inputs! –superuser Jun 13 '12 at 4:18 add a comment| up vote 9 down vote Try to run it using ./executablefilename instead of using sh executablefilename. Then you should add the path in the PATH environment variable, then you can use arm-linux-gcc comment directly .